{"text_format":"1","workbook":"xlsx","n_sheets":9,"sheets":["DATOS GENERALES","LISTA ","1","2","3","PROMEDIOS","GRÁFICA","GENÉRICOS","BOLETA"],"not_rendered":{"charts":2,"images":4,"macros":1,"external_links":0,"defined_names":15,"comments":0,"pivot_tables":0},"unopened":[],"bounds":{"document_bytes":16777216,"sheet_cells":100000,"rows_first":2000,"rows_last":500,"rows_between":2000,"halvings":0,"cell_chars":16384,"cell_head_chars":4096},"cells_cut":0,"cells_raw":0,"read":"whole","date_system":"1900"}

{"sheet":"DATOS GENERALES","index":0,"n_rows":24,"n_cols":6,"rows_kept":24,"cut":false,"hidden":false,"merged":[[6,5,6,6]]}
[]
[]
[]
[null,null,null,null,"PRIMER GRADO PRIMARIA"]
[]
[]
[null,null,null,null,null,"DATOS GENERALES"]
[]
[null,null,null,null,null,"NOMBRE DE LA ESCUELA:"]
[null,null,null,null,null,"CCT:"]
{"$rows_left_out":15}
{"sheet":"LISTA ","index":1,"n_rows":57,"n_cols":24,"rows_kept":57,"cut":false,"hidden":false,"merged":[[4,10,5,10],[7,10,8,10],[0,2,0,3],[0,4,0,9],[2,3,2,4]]}
[null,null,"ESCUELA PRIMARIA   ",null,{"$f":"'DATOS GENERALES'!G9:G9","v":0}]
[null,null,"CICLO  ESCOLAR  2020-2021",null,null,null,null,null,null,null,null,null,null,null,"ESTADISTICA INCIAL "]
[null,null,"  GRUPO  ",{"$f":"'DATOS GENERALES'!G12","v":0},null,null,"AL","2020-09-01"]
["Nº","CURP","NOMBRE  DEL  ALUMNO","SEXO","DIA","MES","AÑO","FECHA_NAC","EDAD","REPETIDOR",null,null,"5 AÑOS","6 AÑOS","7 AÑOS","8 AÑOS","9 AÑOS","10 AÑOS","11 AÑOS","12 AÑOS","13 AÑOS","14 AÑOS","15 AÑOS","TOTAL"]
[1,"GALL050523H",null,{"$f":"MID(B5,11,1)","v":"H"},{"$f":"MID(B5,9,2)","v":"23"},{"$f":"MID(B5,7,2)","v":"05"},{"$f":"MID(B5,5,2)+2000","v":2005},{"$f":"DATE(G5,F5,E5)","v":"2005-05-23"},{"$f":"DATEDIF(H5,$H$3,\"Y\")","v":15},"NO","HOMBRES","NUEVO ING.",{"$f":"COUNTIFS($D$5:$D$49,\"H\",$I$5:$I$49,5,$J$5:$J$49,\"NO\")","v":0},{"$f":"COUNTIFS($D$5:$D$54,\"H\",$I$5:$I$54,6,$J$5:$J$54,\"NO\")","v":0},{"$f":"COUNTIFS($D$5:$D$49,\"H\",$I$5:$I$49,7,$J$5:$J$49,\"NO\")","v":0},{"$f":"COUNTIFS($D$5:$D$49,\"H\",$I$5:$I$49,8,$J$5:$J$49,\"NO\")","v":0},{"$f":"COUNTIFS($D$5:$D$49,\"H\",$I$5:$I$49,9,$J$5:$J$49,\"NO\")","v":0},{"$f":"COUNTIFS($D$5:$D$54,\"H\",$I$5:$I$54,10,$J$5:$J$54,\"NO\")","v":0},{"$f":"COUNTIFS($D$5:$D$49,\"H\",$I$5:$I$49,11,$J$5:$J$49,\"NO\")","v":0},{"$f":"COUNTIFS($D$5:$D$54,\"H\",$I$5:$I$54,12,$J$5:$J$54,\"NO\")","v":0},{"$f":"COUNTIFS($D$5:$D$49,\"H\",$I$5:$I$49,13,$J$5:$J$49,\"NO\")","v":0},{"$f":"COUNTIFS($D$5:$D$49,\"H\",$I$5:$I$49,14,$J$5:$J$49,\"NO\")","v":0},{"$f":"COUNTIFS($D$5:$D$49,\"H\",$I$5:$I$49,15,$J$5:$J$49,\"NO\")","v":4},{"$f":"SUM(M5:W5)","v":4}]
[2,"GALL050623H",null,"H","23","06",2005,{"$f":"DATE(G6,F6,E6)","v":"2005-06-23"},{"$f":"DATEDIF(H6,$H$3,\"Y\")","v":15},"NO",null,"REPETIDORES",{"$f":"COUNTIFS($D$5:$D$49,\"H\",$I$5:$I$49,5,$J$5:$J$49,\"SI\")","v":0},{"$f":"COUNTIFS($D$5:$D$49,\"H\",$I$5:$I$49,6,$J$5:$J$49,\"SI\")","v":0},{"$f":"COUNTIFS($D$5:$D$49,\"H\",$I$5:$I$49,7,$J$5:$J$49,\"SI\")","v":0},{"$f":"COUNTIFS($D$5:$D$54,\"H\",$I$5:$I$54,8,$J$5:$J$54,\"SI\")","v":0},{"$f":"COUNTIFS($D$5:$D$49,\"H\",$I$5:$I$49,9,$J$5:$J$49,\"SI\")","v":0},{"$f":"COUNTIFS($D$5:$D$54,\"H\",$I$5:$I$54,10,$J$5:$J$54,\"SI\")","v":0},{"$f":"COUNTIFS($D$5:$D$49,\"H\",$I$5:$I$49,11,$J$5:$J$49,\"SI\")","v":0},{"$f":"COUNTIFS($D$5:$D$51,\"H\",$I$5:$I$51,12,$J$5:$J$51,\"SI\")","v":0},{"$f":"COUNTIFS($D$5:$D$49,\"H\",$I$5:$I$49,13,$J$5:$J$49,\"SI\")","v":0},{"$f":"COUNTIFS($D$5:$D$49,\"H\",$I$5:$I$49,14,$J$5:$J$49,\"SI\")","v":0},{"$f":"COUNTIFS($D$5:$D$49,\"H\",$I$5:$I$49,15,$J$5:$J$49,\"SI\")","v":0},{"$f":"SUM(M6:W6)","v":0}]
[3,"GALL050525H",null,"H","25","05",2005,"2005-05-25",{"$f":"DATEDIF(H7,$H$3,\"Y\")","v":15},"NO"]
[4,"GALL050513H",null,"H","13","05",2005,"2005-05-13",15,"NO","MUJERES","NUEVO ING.",{"$f":"COUNTIFS($D$5:$D$49,\"M\",$I$5:$I$49,5,$J$5:$J$49,\"NO\")","v":0},{"$f":"COUNTIFS($D$5:$D$49,\"M\",$I$5:$I$49,6,$J$5:$J$49,\"NO\")","v":0},{"$f":"COUNTIFS($D$5:$D$49,\"M\",$I$5:$I$49,7,$J$5:$J$49,\"NO\")","v":0},{"$f":"COUNTIFS($D$5:$D$49,\"M\",$I$5:$I$49,8,$J$5:$J$49,\"NO\")","v":0},{"$f":"COUNTIFS($D$5:$D$49,\"M\",$I$5:$I$49,9,$J$5:$J$49,\"NO\")","v":0},{"$f":"COUNTIFS($D$5:$D$53,\"M\",$I$5:$I$53,10,$J$5:$J$53,\"NO\")","v":0},{"$f":"COUNTIFS($D$5:$D$49,\"M\",$I$5:$I$49,11,$J$5:$J$49,\"NO\")","v":0},{"$f":"COUNTIFS($D$5:$D$54,\"M\",$I$5:$I$54,12,$J$5:$J$54,\"NO\")","v":0},{"$f":"COUNTIFS($D$5:$D$49,\"M\",$I$5:$I$49,13,$J$5:$J$49,\"NO\")","v":0},{"$f":"COUNTIFS($D$5:$D$49,\"M\",$I$5:$I$49,14,$J$5:$J$49,\"NO\")","v":0},{"$f":"COUNTIFS($D$5:$D$49,\"M\",$I$5:$I$49,15,$J$5:$J$49,\"NO\")","v":0},{"$f":"SUM(M8:W8)","v":0}]
[5,null,null,"","","",{"$error":"#VALUE!"},{"$error":"#VALUE!"},{"$error":"#VALUE!"},"NO",null,"REPETIDORES",{"$f":"COUNTIFS($D$5:$D$49,\"M\",$I$5:$I$49,5,$J$5:$J$49,\"SI\")","v":0},{"$f":"COUNTIFS($D$5:$D$49,\"M\",$I$5:$I$49,6,$J$5:$J$49,\"SI\")","v":0},{"$f":"COUNTIFS($D$5:$D$49,\"M\",$I$5:$I$49,7,$J$5:$J$49,\"SI\")","v":0},{"$f":"COUNTIFS($D$5:$D$54,\"M\",$I$5:$I$54,8,$J$5:$J$54,\"SI\")","v":0},{"$f":"COUNTIFS($D$5:$D$54,\"M\",$I$5:$I$54,9,$J$5:$J$54,\"SI\")","v":0},{"$f":"COUNTIFS($D$5:$D$54,\"M\",$I$5:$I$54,10,$J$5:$J$54,\"SI\")","v":0},{"$f":"COUNTIFS($D$5:$D$49,\"M\",$I$5:$I$49,11,$J$5:$J$49,\"SI\")","v":0},{"$f":"COUNTIFS($D$5:$D$49,\"M\",$I$5:$I$49,12,$J$5:$J$49,\"SI\")","v":0},{"$f":"COUNTIFS($D$5:$D$49,\"M\",$I$5:$I$49,13,$J$5:$J$49,\"SI\")","v":0},{"$f":"COUNTIFS($D$5:$D$49,\"M\",$I$5:$I$49,14,$J$5:$J$49,\"SI\")","v":0},{"$f":"COUNTIFS($D$5:$D$49,\"M\",$I$5:$I$49,15,$J$5:$J$49,\"SI\")","v":0},0]
[6,null,null,"","","",{"$error":"#VALUE!"},{"$error":"#VALUE!"},{"$error":"#VALUE!"},"NO"]
{"$rows_left_out":48}
{"sheet":"1","index":2,"n_rows":66,"n_cols":21,"rows_kept":66,"cut":false,"hidden":false,"merged":[[11,20,18,21],[59,14,59,17],[0,0,0,19],[2,2,2,7],[56,7,56,11],[58,4,58,12],[57,14,57,15],[1,2,1,7],[1,14,1,16],[2,17,2,18],[3,17,3,18]]}
["CICLO  ESCOLAR  2020-2021"]
[null,"ESCUELA PRIMARIA ",{"$f":"'DATOS GENERALES'!G9","v":0},null,null,null,null,null,null,null,null,null,"GRUPO ",null,{"$f":"'DATOS GENERALES'!G12","v":0}]
[null,null,"PRIMER PERIODO",null,null,null,null,null,null,null,null,null,null,null,"ASISTENCIAS",null,null,"TOTAL  "]
[null,"INGRESE CANTIDAD DE ALUMNOS",50,null,null,null,null,null,null,null,null,null,"INGRESE DÍAS HÁBILES POR MES",10,20,20,18,{"$f":"SUM(N4:Q4)","v":68}]
["Nº","CURP","NOMBRE  DEL  ALUMNO",null,"ESPAÑOL","MATEMÁTICAS","INGLES","CONOCIMIENTO DEL MEDIO","ARTES","EDUC FISICA","VIDA SALUDABLE","EDUCACIÓN CÍVICA","PROMEDIO","AGOSTO","SEPTIEMBRE","OCTUBRE","NOVIEMBRE","TOTAL ASISTENCIAS","% ASISTENCIA POR ALUMNO"]
[1,{"$f":"'LISTA '!B5","v":"GALL050523H"},{"$f":"'LISTA '!C5","v":0},{"$f":"B6","v":"GALL050523H"},0,null,null,null,null,null,null,null,{"$f":"IFERROR(AVERAGE(E6,F6,H6,I6,J6),\"ND\")","v":0},null,null,null,null,{"$f":"SUM(N6:Q6)","v":0},{"$f":"R6/$R$4","v":0}]
[2,{"$f":"'LISTA '!B6","v":"GALL050623H"},{"$f":"'LISTA '!C6","v":0},{"$f":"B7","v":"GALL050623H"},0,null,null,null,null,null,null,null,{"$f":"IFERROR(AVERAGE(E7,F7,H7,I7,J7),\"ND\")","v":0},null,null,null,null,{"$f":"SUM(N7:Q7)","v":0},{"$f":"R7/$R$4","v":0}]
[3,{"$f":"'LISTA '!B7","v":"GALL050525H"},{"$f":"'LISTA '!C7","v":0},"GALL050525H",0,null,null,null,null,null,null,null,0,null,null,null,null,0,0]
[4,{"$f":"'LISTA '!B8","v":"GALL050513H"},{"$f":"'LISTA '!C8","v":0},"GALL050513H",0,null,null,null,null,null,null,null,0,null,null,null,null,0,0]
[5,{"$f":"'LISTA '!B9","v":0},{"$f":"'LISTA '!C9","v":0},0,0,null,null,null,null,null,null,null,0,null,null,null,null,0,0]
{"$rows_left_out":57}
{"sheet":"2","index":3,"n_rows":66,"n_cols":21,"rows_kept":66,"cut":false,"hidden":false,"merged":[[3,17,3,18],[0,0,0,19],[1,2,1,7],[1,14,1,16],[2,2,2,7],[2,17,2,18],[11,20,18,21],[56,7,56,11],[57,14,57,15],[58,4,58,12],[59,14,59,17]]}
["CICLO  ESCOLAR  2020-2021"]
[null,"ESCUELA PRIMARIA ",{"$f":"'DATOS GENERALES'!G9","v":0},null,null,null,null,null,null,null,null,null,"GRUPO ",null,{"$f":"'DATOS GENERALES'!G12","v":0}]
[null,null,"SEGUNDO PERIODO",null,null,null,null,null,null,null,null,null,null,null,"ASISTENCIAS",null,null,"TOTAL  "]
[null,"INGRESE CANTIDAD DE ALUMNOS",50,null,null,null,null,null,null,null,null,null,"INGRESE DÍAS HÁBILES POR MES",10,20,18,18,{"$f":"SUM(N4:Q4)","v":66}]
["Nº","CURP","NOMBRE  DEL  ALUMNO",null,"ESPAÑOL","MATEMÁTICAS","INGLES","CONOCIMIENTO DEL MEDIO","ARTES","EDUC FISICA","VIDA SALUDABLE","EDUCACIÓN CÍVICA","PROMEDIO","DICIEMBRE","ENERO","FEBRERO","MARZO","TOTAL ASISTENCIAS","% ASISTENCIA POR ALUMNO"]
[1,{"$f":"'LISTA '!B5","v":"GALL050523H"},{"$f":"'LISTA '!C5","v":0},{"$f":"B6","v":"GALL050523H"},0,null,null,null,null,null,null,null,{"$f":"IFERROR(AVERAGE(E6,F6,H6,I6,J6),\"ND\")","v":0},null,null,null,null,{"$f":"SUM(N6:Q6)","v":0},{"$f":"R6/$R$4","v":0}]
[2,{"$f":"'LISTA '!B6","v":"GALL050623H"},{"$f":"'LISTA '!C6","v":0},{"$f":"B7","v":"GALL050623H"},0,null,null,null,null,null,null,null,{"$f":"IFERROR(AVERAGE(E7,F7,H7,I7,J7),\"ND\")","v":0},null,null,null,null,{"$f":"SUM(N7:Q7)","v":0},{"$f":"R7/$R$4","v":0}]
[3,{"$f":"'LISTA '!B7","v":"GALL050525H"},{"$f":"'LISTA '!C7","v":0},"GALL050525H",0,null,null,null,null,null,null,null,0,null,null,null,null,0,0]
[4,{"$f":"'LISTA '!B8","v":"GALL050513H"},{"$f":"'LISTA '!C8","v":0},"GALL050513H",0,null,null,null,null,null,null,null,0,null,null,null,null,0,0]
[5,{"$f":"'LISTA '!B9","v":0},{"$f":"'LISTA '!C9","v":0},0,0,null,null,null,null,null,null,null,0,null,null,null,null,0,0]
{"$rows_left_out":57}
{"sheet":"3","index":4,"n_rows":66,"n_cols":21,"rows_kept":66,"cut":false,"hidden":false,"merged":[[3,17,3,18],[0,0,0,19],[1,2,1,7],[1,14,1,16],[2,2,2,7],[2,17,2,18],[11,20,18,21],[56,7,56,11],[57,14,57,15],[58,4,58,12],[59,14,59,17]]}
["CICLO  ESCOLAR  2020-2021"]
[null,"ESCUELA PRIMARIA ",{"$f":"'DATOS GENERALES'!G9","v":0},null,null,null,null,null,null,null,null,null,"GRUPO ",null,{"$f":"'DATOS GENERALES'!G12","v":0}]
[null,null,"TERCER PERIODO",null,null,null,null,null,null,null,null,null,null,null,"ASISTENCIAS",null,null,"TOTAL  "]
[null,"INGRESE CANTIDAD DE ALUMNOS",50,null,null,null,null,null,null,null,null,null,"INGRESE DÍAS HÁBILES POR MES",10,20,20,18,{"$f":"SUM(N4:Q4)","v":68}]
["Nº","CURP","NOMBRE  DEL  ALUMNO",null,"ESPAÑOL","MATEMÁTICAS","INGLES","CONOCIMIENTO DEL MEDIO","ARTES","EDUC FISICA","VIDA SALUDABLE","EDUCACIÓN CÍVICA","PROMEDIO","ABRIL","MAYO","JUNIO","JULIO","TOTAL ASISTENCIAS","% ASISTENCIA POR ALUMNO"]
[1,{"$f":"'LISTA '!B5","v":"GALL050523H"},{"$f":"'LISTA '!C5","v":0},{"$f":"B6","v":"GALL050523H"},0,null,null,null,null,null,null,null,{"$f":"IFERROR(AVERAGE(E6,F6,H6,I6,J6),\"ND\")","v":0},null,null,null,null,{"$f":"SUM(N6:Q6)","v":0},{"$f":"R6/$R$4","v":0}]
[2,{"$f":"'LISTA '!B6","v":"GALL050623H"},{"$f":"'LISTA '!C6","v":0},{"$f":"B7","v":"GALL050623H"},0,null,null,null,null,null,null,null,{"$f":"IFERROR(AVERAGE(E7,F7,H7,I7,J7),\"ND\")","v":0},null,null,null,null,{"$f":"SUM(N7:Q7)","v":0},{"$f":"R7/$R$4","v":0}]
[3,{"$f":"'LISTA '!B7","v":"GALL050525H"},{"$f":"'LISTA '!C7","v":0},"GALL050525H",0,null,null,null,null,null,null,null,0,null,null,null,null,0,0]
[4,{"$f":"'LISTA '!B8","v":"GALL050513H"},{"$f":"'LISTA '!C8","v":0},"GALL050513H",0,null,null,null,null,null,null,null,0,null,null,null,null,0,0]
[5,{"$f":"'LISTA '!B9","v":0},{"$f":"'LISTA '!C9","v":0},0,0,null,null,null,null,null,null,null,0,null,null,null,null,0,0]
{"$rows_left_out":57}
{"sheet":"PROMEDIOS","index":5,"n_rows":62,"n_cols":15,"rows_kept":62,"cut":false,"hidden":false,"merged":[[11,16,18,17],[57,4,57,12],[0,0,0,15],[1,2,1,7],[2,2,2,7],[2,13,2,14],[3,13,3,14]]}
["CICLO  ESCOLAR 2020-2021"]
[null,"ESCUELA PRIMARIA ",{"$f":"'DATOS GENERALES'!G9","v":0},null,null,null,null,null,null,null,null,null,"GRUPO ",null,{"$f":"'DATOS GENERALES'!G12","v":0}]
[null,null,null,null,null,null,null,null,null,null,null,null,null,"TOTAL  "]
[null,"INGRESE CANTIDAD DE ALUMNOS",50,null,null,null,null,null,null,null,null,null,"DÍAS HÁBILES ",{"$f":"IFERROR(SUM('1'!R4:S4,'2'!R4:S4,'3'!R4:S4),\"SIN DATOS\")","v":202}]
["Nº","CURP","NOMBRE  DEL  ALUMNO",null,"ESPAÑOL","MATEMÁTICAS","INGLES","CONOCIMIENTO DEL MEDIO","ARTES","EDUC FISICA","VIDA SALUDABLE","EDUCACIÓN CÍVICA","PROMEDIO","TOTAL ASISTENCIAS","% ASISTENCIA POR ALUMNO"]
[1,{"$f":"'LISTA '!B5","v":"GALL050523H"},{"$f":"'LISTA '!C5","v":0},{"$f":"B6","v":"GALL050523H"},{"$f":"IFERROR(AVERAGE('1'!E6,'2'!E6,'3'!E6),\"ND\")","v":0},{"$f":"IFERROR(AVERAGE('1'!F6,'2'!F6,'3'!F6),\"ND\")","v":"ND"},{"$f":"IFERROR(AVERAGE('1'!G6,'2'!G6,'3'!G6),\"ND\")","v":"ND"},{"$f":"IFERROR(AVERAGE('1'!H6,'2'!H6,'3'!H6),\"ND\")","v":"ND"},{"$f":"IFERROR(AVERAGE('1'!I6,'2'!I6,'3'!I6),\"ND\")","v":"ND"},{"$f":"IFERROR(AVERAGE('1'!J6,'2'!J6,'3'!J6),\"ND\")","v":"ND"},{"$f":"IFERROR(AVERAGE('1'!K6,'2'!K6,'3'!K6),\"ND\")","v":"ND"},{"$f":"IFERROR(AVERAGE('1'!L6,'2'!L6,'3'!L6),\"ND\")","v":"ND"},{"$f":"IFERROR(AVERAGE(E6,F6,H6,I6,J6),\"ND\")","v":0},{"$f":"'1'!R6+'2'!R6+'3'!R6","v":0},{"$f":"N6/$N$4","v":0}]
[2,{"$f":"'LISTA '!B6","v":"GALL050623H"},{"$f":"'LISTA '!C6","v":0},{"$f":"B7","v":"GALL050623H"},{"$f":"IFERROR(AVERAGE('1'!E7,'2'!E7,'3'!E7),\"ND\")","v":0},{"$f":"IFERROR(AVERAGE('1'!F7,'2'!F7,'3'!F7),\"ND\")","v":"ND"},{"$f":"IFERROR(AVERAGE('1'!G7,'2'!G7,'3'!G7),\"ND\")","v":"ND"},{"$f":"IFERROR(AVERAGE('1'!H7,'2'!H7,'3'!H7),\"ND\")","v":"ND"},{"$f":"IFERROR(AVERAGE('1'!I7,'2'!I7,'3'!I7),\"ND\")","v":"ND"},{"$f":"IFERROR(AVERAGE('1'!J7,'2'!J7,'3'!J7),\"ND\")","v":"ND"},{"$f":"IFERROR(AVERAGE('1'!K7,'2'!K7,'3'!K7),\"ND\")","v":"ND"},{"$f":"IFERROR(AVERAGE('1'!L7,'2'!L7,'3'!L7),\"ND\")","v":"ND"},{"$f":"IFERROR(AVERAGE(E7,F7,H7,I7,J7),\"ND\")","v":0},{"$f":"'1'!R7+'2'!R7+'3'!R7","v":0},{"$f":"N7/$N$4","v":0}]
[3,{"$f":"'LISTA '!B7","v":"GALL050525H"},{"$f":"'LISTA '!C7","v":0},"GALL050525H",{"$f":"IFERROR(AVERAGE('1'!E8,'2'!E8,'3'!E8),\"ND\")","v":0},{"$f":"IFERROR(AVERAGE('1'!F8,'2'!F8,'3'!F8),\"ND\")","v":"ND"},{"$f":"IFERROR(AVERAGE('1'!G8,'2'!G8,'3'!G8),\"ND\")","v":"ND"},{"$f":"IFERROR(AVERAGE('1'!H8,'2'!H8,'3'!H8),\"ND\")","v":"ND"},{"$f":"IFERROR(AVERAGE('1'!I8,'2'!I8,'3'!I8),\"ND\")","v":"ND"},{"$f":"IFERROR(AVERAGE('1'!J8,'2'!J8,'3'!J8),\"ND\")","v":"ND"},{"$f":"IFERROR(AVERAGE('1'!K8,'2'!K8,'3'!K8),\"ND\")","v":"ND"},{"$f":"IFERROR(AVERAGE('1'!L8,'2'!L8,'3'!L8),\"ND\")","v":"ND"},0,{"$f":"'1'!R8+'2'!R8+'3'!R8","v":0},0]
[4,{"$f":"'LISTA '!B8","v":"GALL050513H"},{"$f":"'LISTA '!C8","v":0},"GALL050513H",{"$f":"IFERROR(AVERAGE('1'!E9,'2'!E9,'3'!E9),\"ND\")","v":0},{"$f":"IFERROR(AVERAGE('1'!F9,'2'!F9,'3'!F9),\"ND\")","v":"ND"},{"$f":"IFERROR(AVERAGE('1'!G9,'2'!G9,'3'!G9),\"ND\")","v":"ND"},{"$f":"IFERROR(AVERAGE('1'!H9,'2'!H9,'3'!H9),\"ND\")","v":"ND"},{"$f":"IFERROR(AVERAGE('1'!I9,'2'!I9,'3'!I9),\"ND\")","v":"ND"},{"$f":"IFERROR(AVERAGE('1'!J9,'2'!J9,'3'!J9),\"ND\")","v":"ND"},{"$f":"IFERROR(AVERAGE('1'!K9,'2'!K9,'3'!K9),\"ND\")","v":"ND"},{"$f":"IFERROR(AVERAGE('1'!L9,'2'!L9,'3'!L9),\"ND\")","v":"ND"},0,{"$f":"'1'!R9+'2'!R9+'3'!R9","v":0},0]
[5,{"$f":"'LISTA '!B9","v":0},{"$f":"'LISTA '!C9","v":0},0,{"$f":"IFERROR(AVERAGE('1'!E10,'2'!E10,'3'!E10),\"ND\")","v":0},{"$f":"IFERROR(AVERAGE('1'!F10,'2'!F10,'3'!F10),\"ND\")","v":"ND"},{"$f":"IFERROR(AVERAGE('1'!G10,'2'!G10,'3'!G10),\"ND\")","v":"ND"},{"$f":"IFERROR(AVERAGE('1'!H10,'2'!H10,'3'!H10),\"ND\")","v":"ND"},{"$f":"IFERROR(AVERAGE('1'!I10,'2'!I10,'3'!I10),\"ND\")","v":"ND"},{"$f":"IFERROR(AVERAGE('1'!J10,'2'!J10,'3'!J10),\"ND\")","v":"ND"},{"$f":"IFERROR(AVERAGE('1'!K10,'2'!K10,'3'!K10),\"ND\")","v":"ND"},{"$f":"IFERROR(AVERAGE('1'!L10,'2'!L10,'3'!L10),\"ND\")","v":"ND"},0,{"$f":"'1'!R10+'2'!R10+'3'!R10","v":0},0]
{"$rows_left_out":53}
{"sheet":"GRÁFICA","index":6,"n_rows":38,"n_cols":10,"rows_kept":38,"cut":false,"hidden":false,"merged":[[33,1,33,3],[31,1,31,3],[32,1,32,3],[31,5,31,6],[0,0,0,9],[1,0,1,9],[2,1,2,9]]}
[{"$f":"'DATOS GENERALES'!G9","v":0}]
["APROVECHAMIENTO POR PERIODO"]
[null,{"$f":"'DATOS GENERALES'!G12","v":0}]
[null,"PERIODO",{"$f":"'1'!E5","v":"ESPAÑOL"},{"$f":"'1'!F5","v":"MATEMÁTICAS"},{"$f":"'1'!G5","v":"INGLES"},{"$f":"'1'!H5","v":"CONOCIMIENTO DEL MEDIO"},{"$f":"'1'!I5","v":"ARTES"},{"$f":"'1'!J5","v":"EDUC FISICA"},{"$f":"'1'!K5","v":"VIDA SALUDABLE"},{"$f":"'1'!L5","v":"EDUCACIÓN CÍVICA"}]
[null,"PERIODO 1",{"$f":"'1'!E60","v":0},{"$f":"'1'!F60","v":{"$error":"#DIV/0!"}},{"$f":"'1'!G60","v":{"$error":"#DIV/0!"}},{"$f":"'1'!H60","v":{"$error":"#DIV/0!"}},{"$f":"'1'!I60","v":{"$error":"#DIV/0!"}},{"$f":"'1'!J60","v":{"$error":"#DIV/0!"}},{"$f":"'1'!K60","v":{"$error":"#DIV/0!"}},{"$f":"'1'!L60","v":{"$error":"#DIV/0!"}}]
[null,"PERIODO 2",{"$f":"'2'!E60","v":0},{"$f":"'2'!F60","v":{"$error":"#DIV/0!"}},{"$f":"'2'!G60","v":{"$error":"#DIV/0!"}},{"$f":"'2'!H60","v":{"$error":"#DIV/0!"}},{"$f":"'2'!I60","v":{"$error":"#DIV/0!"}},{"$f":"'2'!J60","v":{"$error":"#DIV/0!"}},{"$f":"'2'!K60","v":{"$error":"#DIV/0!"}},{"$f":"'2'!L60","v":{"$error":"#DIV/0!"}}]
[null,"PERIODO 3",{"$f":"'3'!E60","v":0},{"$f":"'3'!F60","v":{"$error":"#DIV/0!"}},{"$f":"'3'!G60","v":{"$error":"#DIV/0!"}},{"$f":"'3'!H60","v":{"$error":"#DIV/0!"}},{"$f":"'3'!I60","v":{"$error":"#DIV/0!"}},{"$f":"'3'!J60","v":{"$error":"#DIV/0!"}},{"$f":"'3'!K60","v":{"$error":"#DIV/0!"}},{"$f":"'3'!L60","v":{"$error":"#DIV/0!"}}]
[]
[]
[]
{"$rows_left_out":29}
{"sheet":"GENÉRICOS","index":7,"n_rows":10,"n_cols":2,"rows_kept":10,"cut":false,"hidden":false,"merged":[]}
[]
[null,"COMENTARIOS Y RECOMENDACIONES DEL DOCENTE"]
[null,"Que el alumno escriba notas de su interés"]
[null,"Reforzar conteo y ordenar números hasta 100"]
[null,"Se le pueden poner algunos problemas matemáticos que impliquen suma y resta hasta 100"]
[null,"puede hacer recolección de datos en casa, como preferencias de los miembros de la familia."]
[null,"Puede seguir reforzando canciones y rondas infantiles"]
[null,"Sugerir algunas actividades para mejorar el trazo."]
[null,"Es muy articulado oralmente y su expresión adecuada."]
[null,"Es importante que siga trabajando en la escritura de palabras a partir del alfabeto móvil."]
{"$rows_left_out":1}
{"sheet":"BOLETA","index":8,"n_rows":73,"n_cols":12,"rows_kept":73,"cut":false,"hidden":false,"merged":[[50,0,60,0],[61,0,71,0],[72,0,82,0],[81,1,81,13],[82,1,82,13],[83,1,83,13],[75,1,75,13],[76,1,76,13],[77,1,77,13],[78,1,78,13],[79,1,79,13],[80,1,80,13],[66,1,66,13],[67,1,67,13],[68,1,68,13],[69,1,69,13],[70,1,70,13],[71,1,71,13],[72,1,72,13],[73,1,73,13],[74,1,74,13],[58,1,58,13],[59,1,59,13],[60,1,60,13],[61,1,61,13],[62,1,62,13],[63,1,63,13],[64,1,64,13],[65,1,65,13],[49,1,49,13],[50,1,50,13],[54,1,54,13],[55,1,55,13],[56,1,56,13],[51,1,51,13],[52,1,52,13],[53,1,53,13],[57,1,57,13],[8,10,8,13],[13,7,13,9],[13,11,13,13],[12,11,12,13],[12,7,12,9],[13,4,13,5],[29,1,30,1],[29,2,30,2],[29,3,30,3],[29,4,30,4],[29,5,30,5],[21,3,22,3],[21,2,22,2],[12,4,12,5],[13,1,13,2],[12,1,12,2],[9,3,9,4],[9,6,9,7],[44,8,44,9],[36,10,38,11],[31,1,32,1],[31,2,32,2],[31,3,32,3],[31,4,32,4],[43,1,43,5],[20,9,20,11],[21,9,21,11],[44,1,44,5],[17,1,18,1],[17,2,18,2],[17,3,18,3],[17,4,18,4],[17,5,18,5],[19,1,20,1],[19,2,20,2],[19,3,20,3],[36,1,36,5],[35,1,35,5],[39,1,39,5],[40,1,40,5],[19,4,20,4],[19,5,20,5],[21,1,22,1],[31,5,32,5],[27,1,28,1],[27,2,28,2],[27,3,28,3],[27,4,28,4],[27,5,28,5],[17,0,24,0],[25,0,28,0],[8,1,8,9],[23,2,24,2],[25,2,26,2],[25,1,26,1],[23,5,24,5],[25,5,26,5],[23,3,24,3],[23,4,24,4],[25,3,26,3],[25,4,26,4],[15,7,15,13],[16,7,16,10],[17,7,17,10],[18,7,18,10],[16,11,16,13],[15,2,15,4],[15,1,16,1],[17,11,17,13],[18,11,18,13],[25,7,25,13],[21,4,22,4],[21,5,22,5]]}
[]
[]
[]
[]
[]
[]
[null,"DATOS DEL ALUMNO"]
[]
[null,"GRANADOS LARA LUIS GILBERTO",null,null,null,null,null,null,null,null,{"$f":"VLOOKUP(B9,'1'!C5:E55,2,FALSE)","v":{"$error":"#N/A"}}]
[null,"PRIMER APELLIDO",null,"SEGUNDO APELLIDO",null,null,"NOMBRES",null,null,null,null,"CURP"]
{"$rows_left_out":63}